ArchiMate 4.0 Presentation Contexts
type: ConceptScheme
definition: Stakeholder-specific presentation themes for ArchiMate 4.0 views.
has top concept: Executive / C-Level
has top concept: Architect
has top concept: Developer / Engineering
has top concept: Operations / Infrastructure
has top concept: Governance / Compliance

Executive / C-Level
type: Concept
top concept of: ArchiMate 4.0 Presentation Contexts
definition: High-level overview with minimal technical detail. Focus on business capabilities, strategic alignment, cost, and risk.
in scheme: ArchiMate 4.0 Presentation Contexts

Architect
type: Concept
top concept of: ArchiMate 4.0 Presentation Contexts
definition: Full ArchiMate notation with all domains visible. Detailed element properties, relationship types, and cross-domain dependencies.
in scheme: ArchiMate 4.0 Presentation Contexts

Developer / Engineering
type: Concept
top concept of: ArchiMate 4.0 Presentation Contexts
definition: Focus on application and technology domains. Detailed interfaces, data flows, deployment topology.
in scheme: ArchiMate 4.0 Presentation Contexts

Operations / Infrastructure
type: Concept
top concept of: ArchiMate 4.0 Presentation Contexts
definition: Focus on technology domain and deployment. Nodes, devices, networks, environments.
in scheme: ArchiMate 4.0 Presentation Contexts

Governance / Compliance
type: Concept
top concept of: ArchiMate 4.0 Presentation Contexts
definition: Focus on standards compliance, lifecycle states, ownership, and change management.
in scheme: ArchiMate 4.0 Presentation Contexts