Linked.Archi DoDAF Taxonomy
type: Ontology
imports: core#
license: http://creativecommons.org/licenses/by/4.0/
preferred namespace prefix: dodaftax
creator: Kalin Maldzhanski
description: SKOS taxonomy classifying DoDAF 2.02 entities by viewpoint.
created: 2026-05-03
modified: 2026-05-03
publisher: Linked.Archi
publisher: linked.archi
status: draft
version IRI: 2.02#
version info: 2.02
source: DoD-Architecture-Framework

DoDAF Concept Scheme
type: ConceptScheme
definition: Classification of DoDAF 2.02 entities by viewpoint.
has top concept: Entity by Viewpoint

Entity by Viewpoint
type: Concept
top concept of: DoDAF Concept Scheme
in scheme: DoDAF Concept Scheme

All Viewpoint (AV)
type: Concept
broader: Entity by Viewpoint
definition: Overarching aspects of architecture context that relate to all viewpoints.
in scheme: DoDAF Concept Scheme

Capability Viewpoint (CV)
type: Concept
broader: Entity by Viewpoint
definition: Capability requirements, delivery timing, and deployed capability.
in scheme: DoDAF Concept Scheme

Data and Information Viewpoint (DIV)
type: Concept
broader: Entity by Viewpoint
definition: Data relationships and alignment structures — conceptual, logical, and physical data models.
in scheme: DoDAF Concept Scheme

Operational Viewpoint (OV)
type: Concept
broader: Entity by Viewpoint
definition: Operational scenarios, activities, and requirements that support capabilities.
in scheme: DoDAF Concept Scheme

Project Viewpoint (PV)
type: Concept
broader: Entity by Viewpoint
definition: Relationships between operational/capability requirements and projects being implemented.
in scheme: DoDAF Concept Scheme

Services Viewpoint (SvcV)
type: Concept
broader: Entity by Viewpoint
definition: Design for solutions articulating performers, activities, services, and their exchanges.
in scheme: DoDAF Concept Scheme

Standards Viewpoint (StdV)
type: Concept
broader: Entity by Viewpoint
definition: Applicable operational, business, technical, and industry standards.
in scheme: DoDAF Concept Scheme

Systems Viewpoint (SV)
type: Concept
broader: Entity by Viewpoint
definition: Legacy system descriptions — systems, their composition, interconnectivity, and context.
in scheme: DoDAF Concept Scheme