Cloud Platform Taxonomy
type: Ontology
license: http://creativecommons.org/licenses/by/4.0/
preferred namespace prefix: cptax
created: 2026-05-03
version info: 0.1.0

Cloud Platform Classification
type: ConceptScheme
has top concept: Runtime Services
has top concept: Data Services
has top concept: Integration Services
has top concept: Observability
has top concept: Infrastructure

Runtime Services
type: Concept
top concept of: Cloud Platform Classification
in scheme: Cloud Platform Classification
definition: Services that execute business logic.

Data Services
type: Concept
top concept of: Cloud Platform Classification
in scheme: Cloud Platform Classification
definition: Services that store and manage data.

Integration Services
type: Concept
top concept of: Cloud Platform Classification
in scheme: Cloud Platform Classification
definition: Services that connect and route messages between components.

Observability
type: Concept
top concept of: Cloud Platform Classification
in scheme: Cloud Platform Classification
definition: Monitoring, logging, and tracing infrastructure.

Infrastructure
type: Concept
top concept of: Cloud Platform Classification
in scheme: Cloud Platform Classification
definition: Container orchestration and compute infrastructure.